BDBM50039593 (S)-3-[4-(4-Piperidin-4-yl-butoxy)-phenyl]-2-(thiophene-2-sulfonylamino)-propionic acid::CHEMBL313716
SMILES OC(=O)[C@H](Cc1ccc(OCCCCC2CCNCC2)cc1)NS(=O)(=O)c1cccs1
InChI Key InChIKey=NDJRYOZGPUGFQI-FQEVSTJZSA-N
Data  1 IC50
  Tab Delimited (TSV)   2D SDfile   Computed 3D by Vconf -m prep SDfile
Find this compound or compounds like it in BindingDB:
Activity Spreadsheet -- Enzyme Inhibition Constant Data from BindingDB
Found 1 hit for monomerid = 50039593
TargetIntegrin alpha-IIb/beta-3(Homo sapiens (Human))
Merck Research Laboratories
Curated by ChEMBL
LigandPNGBDBM50039593((S)-3-[4-(4-Piperidin-4-yl-butoxy)-phenyl]-2-(thio...)
Affinity DataIC50:  15nM. Assay description: Inhibition of platelet aggregation as the concentration necessary to inhibit the change in light .
In DepthDetails ArticlePubMed