BDBM50039595 (S)-2-(3-Phenyl-propionylamino)-3-[4-(4-piperidin-4-yl-butoxy)-phenyl]-propionic acid::CHEMBL314609
SMILES OC(=O)[C@H](Cc1ccc(OCCCCC2CCNCC2)cc1)NC(=O)CCc1ccccc1
InChI Key InChIKey=BLFXKDDGAIEYJZ-VWLOTQADSA-N
Data  1 IC50
  Tab Delimited (TSV)   2D SDfile   Computed 3D by Vconf -m prep SDfile
Find this compound or compounds like it in BindingDB:
Activity Spreadsheet -- Enzyme Inhibition Constant Data from BindingDB
Found 1 hit for monomerid = 50039595
TargetIntegrin alpha-IIb/beta-3(Homo sapiens (Human))
Merck Research Laboratories
Curated by ChEMBL
LigandPNGBDBM50039595((S)-2-(3-Phenyl-propionylamino)-3-[4-(4-piperidin-...)
Affinity DataIC50:  100nM. Assay description: Inhibition of platelet aggregation as the concentration necessary to inhibit the change in light .
In DepthDetails ArticlePubMed