BDBM50039965 CHEMBL3358338
SMILES CN(C)c1ccc2c(ccn(-c3cccc(-c4cc(Nc5ccc(cn5)C(=O)N5CCOCC5)c(=O)n(C)c4)c3CO)c2=O)c1
InChI Key InChIKey=OLRVVVZNPYWNDA-UHFFFAOYSA-N
Data  1 IC50
  Tab Delimited (TSV)   2D SDfile   Computed 3D by Vconf -m prep SDfile
Find this compound or compounds like it in BindingDB:
Activity Spreadsheet -- Enzyme Inhibition Constant Data from BindingDB
Found 1 hit for monomerid = 50039965
TargetTyrosine-protein kinase BTK(Homo sapiens (Human))
Hoffmann-La Roche
Curated by ChEMBL
LigandPNGBDBM50039965(CHEMBL3358338)
Affinity DataIC50:  280nM. Assay description: Inhibition of BTK in human whole blood assessed as decrease in CD69 positive cells
In DepthDetails ArticlePubMed