BDBM50040193 1-(1-Benzo[b]thiophen-2-yl-cyclohexyl)-pyrrolidine::CHEMBL18618
SMILES C1CCN(C1)C1(CCCCC1)c1cc2ccccc2s1
InChI Key InChIKey=NDVZYCXZMVQYBS-UHFFFAOYSA-N
Data  1 KI  5 IC50
  Tab Delimited (TSV)   2D SDfile   Computed 3D by Vconf -m prep SDfile
Find this compound or compounds like it in BindingDB:
Activity Spreadsheet -- Enzyme Inhibition Constant Data from BindingDB
Found 6 hits for monomerid = 50040193
TargetSigma non-opioid intracellular receptor 1(Homo sapiens (Human))
National Institute Of Diabetes And Digestive And Kidney Diseases
Curated by ChEMBL
LigandPNGBDBM50040193(1-(1-Benzo[b]thiophen-2-yl-cyclohexyl)-pyrrolidine...)
Affinity DataKi:  168nM. Assay description: Inhibition of [3H](+)-pentazocine binding to sigma receptor of guinea pig brain homogenates
In DepthDetails ArticlePubMed
TargetSodium-dependent dopamine transporter(Rattus norvegicus (rat))
National Institute Of Diabetes And Digestive And Kidney Diseases
Curated by ChEMBL
LigandPNGBDBM50040193(1-(1-Benzo[b]thiophen-2-yl-cyclohexyl)-pyrrolidine...)
Affinity DataIC50:  78nM. Assay description: Tested for inhibition of radioligand [3H]dopamine (DA) uptake in rat synaptosomes
In DepthDetails ArticlePubMed
TargetSodium-dependent dopamine transporter(Rattus norvegicus (rat))
National Institute Of Diabetes And Digestive And Kidney Diseases
Curated by ChEMBL
LigandPNGBDBM50040193(1-(1-Benzo[b]thiophen-2-yl-cyclohexyl)-pyrrolidine...)
Affinity DataIC50:  78nM. Assay description: Tested for inhibition of radioligand [3H]dopamine (DA) uptake in rat synaptosomes
In DepthDetails ArticlePubMed
TargetSodium-dependent dopamine transporter(Rattus norvegicus (rat))
National Institute Of Diabetes And Digestive And Kidney Diseases
Curated by ChEMBL
LigandPNGBDBM50040193(1-(1-Benzo[b]thiophen-2-yl-cyclohexyl)-pyrrolidine...)
Affinity DataIC50:  12nM. Assay description: Inhibition of [3H]cocaine binding to rat forebrain dopamine receptor
In DepthDetails ArticlePubMed
TargetSodium-dependent dopamine transporter(Rattus norvegicus (rat))
National Institute Of Diabetes And Digestive And Kidney Diseases
Curated by ChEMBL
LigandPNGBDBM50040193(1-(1-Benzo[b]thiophen-2-yl-cyclohexyl)-pyrrolidine...)
Affinity DataIC50:  6.70nM. Assay description: Displacement of [3H]BTCP (1-[1-(2-benxo[b]thienyl)cyclohexyl]piperidine) from rat forebrain dopamine transporter
In DepthDetails ArticlePubMed
TargetSodium-dependent dopamine transporter(Rattus norvegicus (rat))
National Institute Of Diabetes And Digestive And Kidney Diseases
Curated by ChEMBL
LigandPNGBDBM50040193(1-(1-Benzo[b]thiophen-2-yl-cyclohexyl)-pyrrolidine...)
Affinity DataIC50:  684nM. Assay description: Tested for radioligand [3H]cocaine displacement from dopamine transporter in rat forebrain
In DepthDetails ArticlePubMed