BDBM50040595 (R)-4-(1,3-Dioxo-1,3-dihydro-benzo[f]isoindol-2-yl)-2-{(S)-3-methyl-1-[(2-methyl-2H-tetrazol-5-ylmethyl)-carbamoyl]-butylamino}-butyric acid::CHEMBL349800
SMILES CC(C)C[C@H](N[C@H](CCN1C(=O)c2cc3ccccc3cc2C1=O)C(O)=O)C(=O)NCc1nnn(C)n1
InChI Key InChIKey=SHHQJBCQHBRODF-UXHICEINSA-N
Data  3 IC50
  Tab Delimited (TSV)   2D SDfile   Computed 3D by Vconf -m prep SDfile
Find this compound or compounds like it in BindingDB:
Activity Spreadsheet -- Enzyme Inhibition Constant Data from BindingDB
Found 3 hits for monomerid = 50040595
TargetMatrix metalloproteinase-9(Homo sapiens (Human))
Glaxo Inc. Research Institute
Curated by ChEMBL
LigandPNGBDBM50040595((R)-4-(1,3-Dioxo-1,3-dihydro-benzo[f]isoindol-2-yl...)
Affinity DataIC50:  30nM. Assay description: Activity against human gelatinase (MMP-9).
In DepthDetails ArticlePubMed
TargetStromelysin-1(Homo sapiens (Human))
Glaxo Inc. Research Institute
Curated by ChEMBL
LigandPNGBDBM50040595((R)-4-(1,3-Dioxo-1,3-dihydro-benzo[f]isoindol-2-yl...)
Affinity DataIC50:  2.98E+3nM. Assay description: Activity against human stromelysin (MMP-3).
In DepthDetails ArticlePubMed
TargetInterstitial collagenase(Homo sapiens (Human))
Glaxo Inc. Research Institute
Curated by ChEMBL
LigandPNGBDBM50040595((R)-4-(1,3-Dioxo-1,3-dihydro-benzo[f]isoindol-2-yl...)
Affinity DataIC50:  270nM. Assay description: Activity against human collagenase (MMP-1).
In DepthDetails ArticlePubMed