BDBM50041889 3-Cyclopentyloxy-N-(3,5-dimethyl-2,3-dihydro-isoxazol-3-yl)-4-methoxy-benzamide::CHEMBL50012
SMILES COc1ccc(cc1OC1CCCC1)C(=O)NC1(C)NOC(C)=C1
InChI Key InChIKey=YJCFBSWULYBNSQ-UHFFFAOYSA-N
Data  1 IC50
  Tab Delimited (TSV)   2D SDfile   Computed 3D by Vconf -m prep SDfile
Find this compound or compounds like it in BindingDB:
Activity Spreadsheet -- Enzyme Inhibition Constant Data from BindingDB
Found 1 hit for monomerid = 50041889
Target3',5'-cyclic-AMP phosphodiesterase(Sus scrofa)
RhôNe-Poulenc Rorer
Curated by ChEMBL
LigandPNGBDBM50041889(3-Cyclopentyloxy-N-(3,5-dimethyl-2,3-dihydro-isoxa...)
Affinity DataIC50:  450nM. Assay description: Inhibitory potency against pig aortic PDE IV
In DepthDetails ArticlePubMed