BDBM50042945 3-(3,4-Dihydroxy-phenyl)-1-(3-methoxy-phenyl)-propenone::CHEMBL126894
SMILES COc1cccc(c1)C(=O)\C=C\c1ccc(O)c(O)c1
InChI Key InChIKey=IXYHLIIXLGOBCH-FNORWQNLSA-N
Data  1 IC50
  Tab Delimited (TSV)   2D SDfile   Computed 3D by Vconf -m prep SDfile
Find this compound or compounds like it in BindingDB:
Activity Spreadsheet -- Enzyme Inhibition Constant Data from BindingDB
Found 1 hit for monomerid = 50042945
TargetPolyunsaturated fatty acid 5-lipoxygenase(Rattus norvegicus)
Tokushima Bunri University
Curated by ChEMBL
LigandPNGBDBM50042945(3-(3,4-Dihydroxy-phenyl)-1-(3-methoxy-phenyl)-prop...)
Affinity DataIC50:  6.5nM. Assay description: In vitro inhibition against 5-lipoxygenase in RBL-1 cells was determined
In DepthDetails ArticlePubMed