BDBM50042971 3-(3,4-Dihydroxy-phenyl)-1-(5-ethoxy-2-hydroxy-phenyl)-propenone::CHEMBL338199
SMILES CCOc1ccc(O)c(c1)C(=O)\C=C\c1ccc(O)c(O)c1
InChI Key InChIKey=JCSCQSJOWOUBQO-ZZXKWVIFSA-N
Data  1 IC50
  Tab Delimited (TSV)   2D SDfile   Computed 3D by Vconf -m prep SDfile
Find this compound or compounds like it in BindingDB:
Activity Spreadsheet -- Enzyme Inhibition Constant Data from BindingDB
Found 1 hit for monomerid = 50042971
TargetPolyunsaturated fatty acid 5-lipoxygenase(Rattus norvegicus)
Tokushima Bunri University
Curated by ChEMBL
LigandPNGBDBM50042971(3-(3,4-Dihydroxy-phenyl)-1-(5-ethoxy-2-hydroxy-phe...)
Affinity DataIC50:  5.30nM. Assay description: In vitro inhibition against 5-lipoxygenase in RBL-1 cells was determined
In DepthDetails ArticlePubMed