BDBM50043269 4'-[2-Butyl-6-(3,3-dimethyl-ureido)-benzoimidazol-1-ylmethyl]-biphenyl-2-carboxylic acid::CHEMBL130741
SMILES CCCCc1nc2ccc(NC(=O)N(C)C)cc2n1Cc1ccc(cc1)-c1ccccc1C(O)=O
InChI Key InChIKey=NQDYXMOKAOJVNU-UHFFFAOYSA-N
Data  1 IC50
  Tab Delimited (TSV)   2D SDfile   Computed 3D by Vconf -m prep SDfile
Find this compound or compounds like it in BindingDB:
Activity Spreadsheet -- Enzyme Inhibition Constant Data from BindingDB
Found 1 hit for monomerid = 50043269
TargetType-1 angiotensin II receptor B(RAT)
Dr. Karl Thomae
Curated by ChEMBL
LigandPNGBDBM50043269(4'-[2-Butyl-6-(3,3-dimethyl-ureido)-benzoimidazol-...)
Affinity DataIC50:  24nM. Assay description: Inhibition of specific binding of [125I]-angiotensin-II to angiotensin 1 receptor in rat lung membrane preparation
In DepthDetails ArticlePubMed