BDBM50043846 (E)-6-{4-[2-(4-Chloro-benzenesulfonylamino)-ethyl]-phenyl}-6-pyridin-3-yl-hex-5-enoic acid::(Z)-6-{4-[2-(4-Chloro-benzenesulfonylamino)-ethyl]-phenyl}-6-pyridin-3-yl-hex-5-enoic acid::CHEMBL125519
SMILES OC(=O)CCC\C=C(\c1ccc(CCNS(=O)(=O)c2ccc(Cl)cc2)cc1)c1cccnc1
InChI Key InChIKey=LGHLGTHRJNIRCA-ZRJGMHBZSA-N
Data  2 IC50
  Tab Delimited (TSV)   2D SDfile   Computed 3D by Vconf -m prep SDfile
Find this compound or compounds like it in BindingDB:
Activity Spreadsheet -- Enzyme Inhibition Constant Data from BindingDB
Found 2 hits for monomerid = 50043846
TargetThromboxane A2 receptor(Homo sapiens (Human))
Dr. Karl Thomae
Curated by ChEMBL
LigandPNGBDBM50043846((E)-6-{4-[2-(4-Chloro-benzenesulfonylamino)-ethyl]...)
Affinity DataIC50:  380nM. Assay description: Displacement of the high affinity radiolabeled ligand [3H]- SQ-29,548 from the PGH-2/TXA-2 receptor in human gel-filtered platelets.
In DepthDetails ArticlePubMed
TargetThromboxane-A synthase(Homo sapiens (Human))
Dr. Karl Thomae
Curated by ChEMBL
LigandPNGBDBM50043846((E)-6-{4-[2-(4-Chloro-benzenesulfonylamino)-ethyl]...)
Affinity DataIC50:  490nM. Assay description: Inhibition test of thromboxane A2 synthetase in human gel-filtered platelets.
In DepthDetails ArticlePubMed