BDBM50043854 (E)-6-[4-(2-Phenylacetylamino-ethyl)-phenyl]-6-pyridin-3-yl-hex-5-enoic acid::CHEMBL338334
SMILES OC(=O)CCC\C=C(/c1ccc(CCNC(=O)Cc2ccccc2)cc1)c1cccnc1
InChI Key InChIKey=KPHKNVUDNXIVFU-KIBLKLHPSA-N
Data  2 IC50
  Tab Delimited (TSV)   2D SDfile   Computed 3D by Vconf -m prep SDfile
Find this compound or compounds like it in BindingDB:
Activity Spreadsheet -- Enzyme Inhibition Constant Data from BindingDB
Found 2 hits for monomerid = 50043854
TargetThromboxane A2 receptor(Homo sapiens (Human))
Dr. Karl Thomae
Curated by ChEMBL
LigandPNGBDBM50043854((E)-6-[4-(2-Phenylacetylamino-ethyl)-phenyl]-6-pyr...)
Affinity DataIC50:  1.20E+3nM. Assay description: Displacement of the high affinity radiolabeled ligand [3H]- SQ-29,548 from the PGH-2/TXA-2 receptor in human gel-filtered platelets.
In DepthDetails ArticlePubMed
TargetThromboxane-A synthase(Homo sapiens (Human))
Dr. Karl Thomae
Curated by ChEMBL
LigandPNGBDBM50043854((E)-6-[4-(2-Phenylacetylamino-ethyl)-phenyl]-6-pyr...)
Affinity DataIC50:  21nM. Assay description: Inhibition test of thromboxane A2 synthetase in human gel-filtered platelets.
In DepthDetails ArticlePubMed