BDBM50043984 2,2-Bis-(2-chloro-phenyl)-N-[3-(2,6-dimethyl-piperidin-1-yl)-propyl]-acetamide::CHEMBL92018
SMILES CC1CCCC(C)N1CCCNC(=O)C(c1ccccc1Cl)c1ccccc1Cl
InChI Key InChIKey=DJENNRQWYMVEOW-UHFFFAOYSA-N
Data  1 IC50
  Tab Delimited (TSV)   2D SDfile   Computed 3D by Vconf -m prep SDfile
Find this compound or compounds like it in BindingDB:
Activity Spreadsheet -- Enzyme Inhibition Constant Data from BindingDB
Found 1 hit for monomerid = 50043984
TargetSodium channel protein type 2 subunit alpha(Rattus norvegicus)
Warner-Lambert
Curated by ChEMBL
LigandPNGBDBM50043984(2,2-Bis-(2-chloro-phenyl)-N-[3-(2,6-dimethyl-piper...)
Affinity DataIC50:  3.50E+3nM. Assay description: Inhibition of veratridine-induced Na+ influx in chinese hamster ovary cells expressing alpha subunit of rat brain type voltage-gated sodium channel t...
In DepthDetails ArticlePubMed