BDBM50045212 CHEMBL2370041::D-Arg-Arg-Pro-Hyp-Gly-Phe-Ser-D-Tic-Oic-Arg
SMILES [#6]-[#6](-[#7]-[#6](=O)-[#6@@H]-1-[#6]-[#6@H](-[#8])-[#6]-[#7]-1-[#6](=O)-[#6@@H]-1-[#6]-[#6]-[#6]-[#7]-1-[#6](=O)-[#6@H](-[#6]-[#6]-[#6]\[#7]=[#6](\[#7])-[#7])-[#7]-[#6](=O)-[#6@H](-[#7])-[#6]-[#6]-[#6]\[#7]=[#6](\[#7])-[#7])-[#6](=O)-[#7]-[#6@@H](-[#6]-c1ccccc1)-[#6](=O)-[#7]-[#6@@H](-[#6]-[#8])-[#6](=O)-[#7]-1-[#6]-c2ccccc2-[#6]-[#6@@H]-1-[#6](=O)-[#7]-1-[#6]-2-[#6]-[#6]-[#6]-[#6]-[#6]-2-[#6]-[#6@H]-1-[#6](=O)-[#7]-[#6@@H](-[#6]-[#6]-[#6]\[#7]=[#6](\[#7])-[#7])-[#6](-[#8])=O
InChI Key InChIKey=KBFXCONYUPDCIP-SGEGVYRMSA-N
Data  1 KI
  Tab Delimited (TSV)   2D SDfile   Computed 3D by Vconf -m prep SDfile
Find this compound or compounds like it in BindingDB:
Activity Spreadsheet -- Enzyme Inhibition Constant Data from BindingDB
Found 1 hit for monomerid = 50045212
TargetB2 bradykinin receptor(Cavia porcellus)
Scios Nova
Curated by ChEMBL
LigandPNGBDBM50045212(CHEMBL2370041 | D-Arg-Arg-Pro-Hyp-Gly-Phe-Ser-D-Ti...)
Affinity DataKi:  82nM. Assay description: Binding affinity against [3H]-bradykinin binding to bradykinin receptor B2 in guinea pig ileal membrane
In DepthDetails ArticlePubMed