BDBM50045557 CHEMBL3314273
SMILES [Na+].CSc1nccc(n1)-c1c(nc2nc(ccn12)-c1cn(CC([O-])=O)nn1)-c1ccc(F)cc1
InChI Key InChIKey=QDWFTFYNOPLJTF-UHFFFAOYSA-M
Data  5 IC50
  Tab Delimited (TSV)   2D SDfile   Computed 3D by Vconf -m prep SDfile
Find this compound or compounds like it in BindingDB:
Activity Spreadsheet -- Enzyme Inhibition Constant Data from BindingDB
Found 5 hits for monomerid = 50045557
TargetMitogen-activated protein kinase 14(Homo sapiens (Human))
Syncom
Curated by ChEMBL
LigandPNGBDBM50045557(CHEMBL3314273)
Affinity DataIC50:  250nM. Assay description: Inhibition of p38alpha MAPK (unknown origin) by radiometric assay
In DepthDetails ArticlePubMed
TargetCasein kinase I isoform delta(Homo sapiens (Human))
Syncom
Curated by ChEMBL
LigandPNGBDBM50045557(CHEMBL3314273)
Affinity DataIC50: >1.00E+5nM. Assay description: Inhibition of CK1-delta (unknown origin) by radiometric assay
In DepthDetails ArticlePubMed
TargetTyrosine-protein kinase JAK3(Homo sapiens (Human))
Syncom
Curated by ChEMBL
LigandPNGBDBM50045557(CHEMBL3314273)
Affinity DataIC50: >1.00E+5nM. Assay description: Inhibition of JAK3 (unknown origin) by radiometric assay
In DepthDetails ArticlePubMed
TargetTyrosine-protein kinase JAK2(Homo sapiens (Human))
Syncom
Curated by ChEMBL
LigandPNGBDBM50045557(CHEMBL3314273)
Affinity DataIC50: >1.00E+5nM. Assay description: Inhibition of JAK2 (unknown origin) by radiometric assay
In DepthDetails ArticlePubMed
TargetTyrosine-protein kinase JAK1(Homo sapiens (Human))
Syncom
Curated by ChEMBL
LigandPNGBDBM50045557(CHEMBL3314273)
Affinity DataIC50: >1.00E+5nM. Assay description: Inhibition of JAK1 (unknown origin) by radiometric assay
In DepthDetails ArticlePubMed