BDBM50045561 CHEMBL3314277
SMILES OCCn1cc(nn1)-c1ccc(cc1)-c1nc(c([nH]1)-c1cc[nH]c(=O)c1)-c1ccc(F)cc1
InChI Key InChIKey=HJPSQYDUHYYPLU-UHFFFAOYSA-N
Data  5 IC50
  Tab Delimited (TSV)   2D SDfile   Computed 3D by Vconf -m prep SDfile
Find this compound or compounds like it in BindingDB:
Activity Spreadsheet -- Enzyme Inhibition Constant Data from BindingDB
Found 5 hits for monomerid = 50045561
TargetMitogen-activated protein kinase 14(Homo sapiens (Human))
Syncom
Curated by ChEMBL
LigandPNGBDBM50045561(CHEMBL3314277)
Affinity DataIC50:  1.86E+4nM. Assay description: Inhibition of p38alpha MAPK (unknown origin) by radiometric assay
In DepthDetails ArticlePubMed
TargetCasein kinase I isoform delta(Homo sapiens (Human))
Syncom
Curated by ChEMBL
LigandPNGBDBM50045561(CHEMBL3314277)
Affinity DataIC50:  1.79E+4nM. Assay description: Inhibition of CK1-delta (unknown origin) by radiometric assay
In DepthDetails ArticlePubMed
TargetTyrosine-protein kinase JAK3(Homo sapiens (Human))
Syncom
Curated by ChEMBL
LigandPNGBDBM50045561(CHEMBL3314277)
Affinity DataIC50:  1.06E+4nM. Assay description: Inhibition of JAK3 (unknown origin) by radiometric assay
In DepthDetails ArticlePubMed
TargetTyrosine-protein kinase JAK2(Homo sapiens (Human))
Syncom
Curated by ChEMBL
LigandPNGBDBM50045561(CHEMBL3314277)
Affinity DataIC50:  500nM. Assay description: Inhibition of JAK2 (unknown origin) by radiometric assay
In DepthDetails ArticlePubMed
TargetTyrosine-protein kinase JAK1(Homo sapiens (Human))
Syncom
Curated by ChEMBL
LigandPNGBDBM50045561(CHEMBL3314277)
Affinity DataIC50: >1.00E+4nM. Assay description: Inhibition of JAK1 (unknown origin) by radiometric assay
In DepthDetails ArticlePubMed