BDBM50047377 CHEMBL3310767
SMILES C(NC1CCCn2nc(COc3ccccc3)cc12)c1ccncc1
InChI Key InChIKey=YIQPFUPYLOVAHI-UHFFFAOYSA-N
Data  2 EC50
  Tab Delimited (TSV)   2D SDfile   Computed 3D by Vconf -m prep SDfile
Find this compound or compounds like it in BindingDB:
Activity Spreadsheet -- Enzyme Inhibition Constant Data from BindingDB
Found 2 hits for monomerid = 50047377
TargetMetabotropic glutamate receptor 5(Rattus norvegicus (Rat))
Vanderbilt University Medical Center
Curated by ChEMBL
LigandPNGBDBM50047377(CHEMBL3310767)
Affinity DataEC50:  2.57E+3nM. Assay description: Positive allosteric modulation of rat mGlu5 receptor expressed in HEK293 cells
In DepthDetails ArticlePubMed
TargetMetabotropic glutamate receptor 5(Rattus norvegicus (Rat))
Vanderbilt University Medical Center
Curated by ChEMBL
LigandPNGBDBM50047377(CHEMBL3310767)
Affinity DataEC50:  2.57E+3nM. Assay description: Positive allosteric modulation of rat mGlu5 receptor expressed in HEK293 cells
In DepthDetails ArticlePubMed