BDBM50047379 CHEMBL3310747
SMILES CC1(C)CCn2nc(COc3ccccc3)cc2C1OCc1ccccc1
InChI Key InChIKey=BMBVKAHOATXQPS-UHFFFAOYSA-N
Data  2 EC50
  Tab Delimited (TSV)   2D SDfile   Computed 3D by Vconf -m prep SDfile
Find this compound or compounds like it in BindingDB:
Activity Spreadsheet -- Enzyme Inhibition Constant Data from BindingDB
Found 2 hits for monomerid = 50047379
TargetMetabotropic glutamate receptor 5(Rattus norvegicus (Rat))
Vanderbilt University Medical Center
Curated by ChEMBL
LigandPNGBDBM50047379(CHEMBL3310747)
Affinity DataEC50:  2.33E+3nM. Assay description: Positive allosteric modulation of rat mGlu5 receptor expressed in HEK293 cells
In DepthDetails ArticlePubMed
TargetMetabotropic glutamate receptor 5(Rattus norvegicus (Rat))
Vanderbilt University Medical Center
Curated by ChEMBL
LigandPNGBDBM50047379(CHEMBL3310747)
Affinity DataEC50:  2.34E+3nM. Assay description: Positive allosteric modulation of rat mGlu5 receptor expressed in HEK293 cells
In DepthDetails ArticlePubMed