BDBM50047386 CHEMBL3310746
SMILES C(Oc1ccccc1)c1cc2C(CCCn2n1)OCc1ccccc1
InChI Key InChIKey=GRKBJXUSSNESGO-UHFFFAOYSA-N
Data  2 EC50
  Tab Delimited (TSV)   2D SDfile   Computed 3D by Vconf -m prep SDfile
Find this compound or compounds like it in BindingDB:
Activity Spreadsheet -- Enzyme Inhibition Constant Data from BindingDB
Found 2 hits for monomerid = 50047386
TargetMetabotropic glutamate receptor 5(Rattus norvegicus (Rat))
Vanderbilt University Medical Center
Curated by ChEMBL
LigandPNGBDBM50047386(CHEMBL3310746)
Affinity DataEC50:  989nM. Assay description: Positive allosteric modulation of rat mGlu5 receptor expressed in HEK293 cells
In DepthDetails ArticlePubMed
TargetMetabotropic glutamate receptor 5(Rattus norvegicus (Rat))
Vanderbilt University Medical Center
Curated by ChEMBL
LigandPNGBDBM50047386(CHEMBL3310746)
Affinity DataEC50:  1.00E+3nM. Assay description: Positive allosteric modulation of rat mGlu5 receptor expressed in HEK293 cells
In DepthDetails ArticlePubMed