BDBM50047403 CHEMBL3310998
SMILES CC1(C)CCn2nc(OCc3ccccc3)cc2C1=O
InChI Key InChIKey=NAZKXYZVTNBTGD-UHFFFAOYSA-N
Data  2 EC50
  Tab Delimited (TSV)   2D SDfile   Computed 3D by Vconf -m prep SDfile
Find this compound or compounds like it in BindingDB:
Activity Spreadsheet -- Enzyme Inhibition Constant Data from BindingDB
Found 2 hits for monomerid = 50047403
TargetMetabotropic glutamate receptor 5(Rattus norvegicus (Rat))
Vanderbilt University Medical Center
Curated by ChEMBL
LigandPNGBDBM50047403(CHEMBL3310998)
Affinity DataEC50:  228nM. Assay description: Positive allosteric modulation of rat mGlu5 receptor expressed in HEK293 cells
In DepthDetails ArticlePubMed
TargetMetabotropic glutamate receptor 5(Rattus norvegicus (Rat))
Vanderbilt University Medical Center
Curated by ChEMBL
LigandPNGBDBM50047403(CHEMBL3310998)
Affinity DataEC50:  229nM. Assay description: Positive allosteric modulation of rat mGlu5 receptor expressed in HEK293 cells
In DepthDetails ArticlePubMed