BDBM50047986 CHEMBL3314883
SMILES CCOC(=O)c1cnc(NC(=O)Nc2ccccc2)n2nc(nc12)-c1ccco1
InChI Key InChIKey=JJENTLBDQVZIJS-UHFFFAOYSA-N
Data  4 KI
  Tab Delimited (TSV)   2D SDfile   Computed 3D by Vconf -m prep SDfile
Find this compound or compounds like it in BindingDB:
Activity Spreadsheet -- Enzyme Inhibition Constant Data from BindingDB
Found 4 hits for monomerid = 50047986
TargetAdenosine receptor A2a(Homo sapiens (Human))
Universit£
Curated by ChEMBL
LigandPNGBDBM50047986(CHEMBL3314883)
Affinity DataKi:  4.80nM. Assay description: Displacement of [3H]NECA from human adenosine A2A receptor expressed in CHO cells
In DepthDetails ArticlePubMed
TargetAdenosine receptor A1(Homo sapiens (Human))
Universit£
Curated by ChEMBL
LigandPNGBDBM50047986(CHEMBL3314883)
Affinity DataKi:  322nM. Assay description: Displacement of [3H]CCPA from human adenosine A1 receptor expressed in CHO cells
In DepthDetails ArticlePubMed
TargetAdenosine receptor A3(Homo sapiens (Human))
Universit£
Curated by ChEMBL
LigandPNGBDBM50047986(CHEMBL3314883)
Affinity DataKi:  357nM. Assay description: Displacement of [3H]NECA from human adenosine A3 receptor expressed in CHO cells
In DepthDetails ArticlePubMed
TargetAdenosine receptor A2b(Homo sapiens (Human))
Universit£
Curated by ChEMBL
LigandPNGBDBM50047986(CHEMBL3314883)
Affinity DataKi:  1.90E+3nM. Assay description: Antagonist activity at human adenosine A2B receptor expressed in CHO cells assessed as inhibition of NECA-stimulated adenylyl cyclase activity
In DepthDetails ArticlePubMed