BDBM50048376 CHEMBL3310153
SMILES Nc1nc2c3c(NCCCO)cc(F)cc3nc(Cc3ccc4OCOc4c3)n2n1
InChI Key InChIKey=XSJLFCRREWZEQR-UHFFFAOYSA-N
Data  1 KI
  Tab Delimited (TSV)   2D SDfile   Computed 3D by Vconf -m prep SDfile
Find this compound or compounds like it in BindingDB:
Activity Spreadsheet -- Enzyme Inhibition Constant Data from BindingDB
Found 1 hit for monomerid = 50048376
TargetHeat shock protein HSP 90-beta(Homo sapiens (Human))
Nerviano Medical Sciences
Curated by ChEMBL
LigandPNGBDBM50048376(CHEMBL3310153)
Affinity DataKi: >5.00E+3nM. Assay description: Inhibition of Hsp90 (unknown origin) by FP displacement assay
In DepthDetails ArticlePubMed