BDBM50048384 CHEMBL3309979
SMILES Nc1nc2c3ccccc3nc(CCc3cccc(N)c3)n2n1
InChI Key InChIKey=DNHYUSSEMFHEAT-UHFFFAOYSA-N
Data  1 KI
  Tab Delimited (TSV)   2D SDfile   Computed 3D by Vconf -m prep SDfile
Find this compound or compounds like it in BindingDB:
Activity Spreadsheet -- Enzyme Inhibition Constant Data from BindingDB
Found 1 hit for monomerid = 50048384
TargetHeat shock protein HSP 90-beta(Homo sapiens (Human))
Nerviano Medical Sciences
Curated by ChEMBL
LigandPNGBDBM50048384(CHEMBL3309979)
Affinity DataKi:  1.52E+4nM. Assay description: Inhibition of Hsp90 (unknown origin) by NMR FAXS screening method
In DepthDetails ArticlePubMed