BDBM50049033 4-[6-(3-Chloro-4-fluoro-phenyl)-spiro[2.4]hept-5-en-5-yl]-benzenesulfonamide::CHEMBL312822
SMILES NS(=O)(=O)c1ccc(cc1)C1=C(CC2(CC2)C1)c1ccc(F)c(Cl)c1
InChI Key InChIKey=PBSAWAMHURBEDJ-UHFFFAOYSA-N
Data  3 IC50
  Tab Delimited (TSV)   2D SDfile   Computed 3D by Vconf -m prep SDfile
Find this compound or compounds like it in BindingDB:
Activity Spreadsheet -- Enzyme Inhibition Constant Data from BindingDB
Found 3 hits for monomerid = 50049033
TargetProstaglandin G/H synthase 1(Homo sapiens (Human))
Searle Research And Development
Curated by ChEMBL
LigandPNGBDBM50049033(4-[6-(3-Chloro-4-fluoro-phenyl)-spiro[2.4]hept-5-e...)
Affinity DataIC50:  310nM. Assay description: Inhibitory activity against prostaglandin G/H synthase 1 (COX-1).
In DepthDetails ArticlePubMed
TargetProstaglandin G/H synthase 2(Homo sapiens (Human))
Universit£
Curated by ChEMBL
LigandPNGBDBM50049033(4-[6-(3-Chloro-4-fluoro-phenyl)-spiro[2.4]hept-5-e...)
Affinity DataIC50:  1.51nM. Assay description: Inhibition of human Prostaglandin G/H synthase 2
In DepthDetails ArticlePubMed
TargetProstaglandin G/H synthase 2(Homo sapiens (Human))
Universit£
Curated by ChEMBL
LigandPNGBDBM50049033(4-[6-(3-Chloro-4-fluoro-phenyl)-spiro[2.4]hept-5-e...)
Affinity DataIC50:  1.5nM. Assay description: Inhibitory activity of the compound against prostaglandin G/H synthase 2 (COX-2).
In DepthDetails ArticlePubMed