BDBM50049270 4-[(2-Dimethylaminomethyl-7-methyl-4-oxo-3,4-dihydro-quinazolin-6-ylmethyl)-prop-2-ynyl-amino]-2-fluoro-N-(3-nitro-benzyl)-benzamide::CHEMBL159642
SMILES CN(C)Cc1nc2cc(C)c(CN(CC#C)c3ccc(C(=O)NCc4cccc(c4)[N+]([O-])=O)c(F)c3)cc2c(=O)[nH]1
InChI Key InChIKey=QLIJGQPOJXXVAF-UHFFFAOYSA-N
Data  1 IC50
  Tab Delimited (TSV)   2D SDfile   Computed 3D by Vconf -m prep SDfile
Find this compound or compounds like it in BindingDB:
Activity Spreadsheet -- Enzyme Inhibition Constant Data from BindingDB
Found 1 hit for monomerid = 50049270
TargetThymidylate synthase(Mus musculus)
Zeneca Pharma
Curated by ChEMBL
LigandPNGBDBM50049270(4-[(2-Dimethylaminomethyl-7-methyl-4-oxo-3,4-dihyd...)
Affinity DataIC50:  140nM. Assay description: In vitro inhibitory activity against thymidylate synthase partially purified from L1210 mouse leukemia cells
In DepthDetails ArticlePubMed