BDBM50049283 2-Fluoro-4-{[7-methyl-4-oxo-2-(pyrimidin-2-ylsulfanylmethyl)-3,4-dihydro-quinazolin-6-ylmethyl]-prop-2-ynyl-amino}-N-(3-nitro-benzyl)-benzamide::CHEMBL159591
SMILES Cc1cc2nc(CSc3ncccn3)[nH]c(=O)c2cc1CN(CC#C)c1ccc(C(=O)NCc2cccc(c2)[N+]([O-])=O)c(F)c1
InChI Key InChIKey=SEGRUFWVRLIDNV-UHFFFAOYSA-N
Data  1 IC50
  Tab Delimited (TSV)   2D SDfile   Computed 3D by Vconf -m prep SDfile
Find this compound or compounds like it in BindingDB:
Activity Spreadsheet -- Enzyme Inhibition Constant Data from BindingDB
Found 1 hit for monomerid = 50049283
TargetThymidylate synthase(Mus musculus)
Zeneca Pharma
Curated by ChEMBL
LigandPNGBDBM50049283(2-Fluoro-4-{[7-methyl-4-oxo-2-(pyrimidin-2-ylsulfa...)
Affinity DataIC50:  110nM. Assay description: In vitro inhibitory activity against thymidylate synthase partially purified from L1210 mouse leukemia cells
In DepthDetails ArticlePubMed