BDBM50049557 CHEBI:71029::CHEMBL3321990
SMILES N[C@@H](CO)C(=O)N[C@@H](Cc1ccccc1)C(O)=O
InChI Key InChIKey=PPQRSMGDOHLTBE-UWVGGRQHSA-N
Data  1 IC50
  Tab Delimited (TSV)   2D SDfile   Computed 3D by Vconf -m prep SDfile
Find this compound or compounds like it in BindingDB:
Activity Spreadsheet -- Enzyme Inhibition Constant Data from BindingDB
Found 1 hit for monomerid = 50049557
TargetAngiotensin-converting enzyme(Homo sapiens (Human))
Tianjin University
Curated by ChEMBL
LigandPNGBDBM50049557(CHEBI:71029 | CHEMBL3321990)
Affinity DataIC50:  1.28E+8nM. Assay description: Inhibition of ACE (unknown origin)
In DepthDetails ArticlePubMed