BDBM50050146 1-[(2S,3R)-2-((S)-2-Mercapto-3-phenyl-propionylamino)-3-methyl-pentanoyl]-pyrrolidine-2-carboxylic acid::CHEMBL19936
SMILES CC[C@@H](C)[C@H](NC(=O)[C@@H](S)Cc1ccccc1)C(=O)N1CCCC1C(O)=O
InChI Key InChIKey=BZKIFDAXWHHTOV-VSTJFYFISA-N
Data  2 IC50
  Tab Delimited (TSV)   2D SDfile   Computed 3D by Vconf -m prep SDfile
Find this compound or compounds like it in BindingDB:
Activity Spreadsheet -- Enzyme Inhibition Constant Data from BindingDB
Found 2 hits for monomerid = 50050146
TargetAngiotensin-converting enzyme(Rattus norvegicus)
University Of Paris
Curated by ChEMBL
LigandPNGBDBM50050146(1-[(2S,3R)-2-((S)-2-Mercapto-3-phenyl-propionylami...)
Affinity DataIC50:  1.70nM. Assay description: Inhibitory activity against angiotensin I converting enzyme
In DepthDetails ArticlePubMed
TargetNeprilysin(Oryctolagus cuniculus (rabbit))
University Of Paris
Curated by ChEMBL
LigandPNGBDBM50050146(1-[(2S,3R)-2-((S)-2-Mercapto-3-phenyl-propionylami...)
Affinity DataIC50:  24nM. Assay description: Inhibitory activity was tested against neutral endopeptidase
In DepthDetails ArticlePubMed