BDBM50050401 5-Methyl-6-(2-naphthalen-1-yl-ethyl)-pyrido[2,3-d]pyrimidine-2,4-diamine::CHEMBL23374
SMILES Cc1c(CCc2cccc3ccccc23)cnc2nc(N)nc(N)c12
InChI Key InChIKey=JWXPTVVVLVRJEZ-UHFFFAOYSA-N
Data  3 IC50
  Tab Delimited (TSV)   2D SDfile   Computed 3D by Vconf -m prep SDfile
Find this compound or compounds like it in BindingDB:
Activity Spreadsheet -- Enzyme Inhibition Constant Data from BindingDB
Found 3 hits for monomerid = 50050401
TargetDihydrofolate reductase(Pneumocystis carinii)
Southern Research Institute
Curated by ChEMBL
LigandPNGBDBM50050401(5-Methyl-6-(2-naphthalen-1-yl-ethyl)-pyrido[2,3-d]...)
Affinity DataIC50:  64nM. Assay description: Inhibitory activity against Pneumocystis carinii dihydrofolate reductase
In DepthDetails ArticlePubMed
TargetDihydrofolate reductase(Rattus norvegicus (rat))
Southern Research Institute
Curated by ChEMBL
LigandPNGBDBM50050401(5-Methyl-6-(2-naphthalen-1-yl-ethyl)-pyrido[2,3-d]...)
Affinity DataIC50:  135nM. Assay description: Inhibitory activity of the compound against rat liver dihydrofolate reductase
In DepthDetails ArticlePubMed
TargetBifunctional dihydrofolate reductase-thymidylate synthase(Toxoplasma gondii)
Southern Research Institute
Curated by ChEMBL
LigandPNGBDBM50050401(5-Methyl-6-(2-naphthalen-1-yl-ethyl)-pyrido[2,3-d]...)
Affinity DataIC50:  26nM. Assay description: Inhibitory activity against Toxoplasma gondii dihydrofolate reductase
In DepthDetails ArticlePubMed