BDBM50052801 CHEMBL3322886
SMILES NC1=NCC(CN1)C(O)=O
InChI Key InChIKey=PZWMQJZDDYQYGN-UHFFFAOYSA-N
Data  8 EC50
  Tab Delimited (TSV)   2D SDfile   Computed 3D by Vconf -m prep SDfile
Find this compound or compounds like it in BindingDB:
Activity Spreadsheet -- Enzyme Inhibition Constant Data from BindingDB
Found 8 hits for monomerid = 50052801
TargetGamma-aminobutyric acid receptor subunit alpha-1/beta-2/gamma-2(Homo sapiens (Human))
University Of Copenhagen
Curated by ChEMBL
LigandPNGBDBM50052801(CHEMBL3322886)
Affinity DataEC50:  1.40E+4nM. Assay description: Agonist activity at human GABAAalpha1beta2gamma2S receptor expressed in tsA-201cells by FLIPR membrane potential blue assay
In DepthDetails ArticlePubMed
TargetGamma-aminobutyric acid receptor subunit alpha-1/beta-2/gamma-2(Homo sapiens (Human))
University Of Copenhagen
Curated by ChEMBL
LigandPNGBDBM50052801(CHEMBL3322886)
Affinity DataEC50:  1.41E+4nM. Assay description: Agonist activity at human GABAAalpha1beta2gamma2S receptor expressed in tsA-201cells by FLIPR membrane potential blue assay
In DepthDetails ArticlePubMed
TargetGamma-aminobutyric acid receptor subunit rho-1(Homo sapiens (Human))
University Of Copenhagen
Curated by ChEMBL
LigandPNGBDBM50052801(CHEMBL3322886)
Affinity DataEC50:  8.10E+3nM. Assay description: Agonist activity at human GABAA rho1 expressed in tsA-201cells by FLIPR membrane potential blue assay
In DepthDetails ArticlePubMed
TargetGamma-aminobutyric acid receptor subunit alpha-3/beta-2/gamma-2(Homo sapiens (Human))
University Of Copenhagen
Curated by ChEMBL
LigandPNGBDBM50052801(CHEMBL3322886)
Affinity DataEC50:  1.95E+4nM. Assay description: Agonist activity at human GABAAalpha3beta2gamma2S receptor expressed in tsA-201cells by FLIPR membrane potential blue assay
In DepthDetails ArticlePubMed
TargetGamma-aminobutyric acid receptor subunit alpha-2/beta-2/gamma-2(Homo sapiens (Human))
University Of Copenhagen
Curated by ChEMBL
LigandPNGBDBM50052801(CHEMBL3322886)
Affinity DataEC50:  9.40E+3nM. Assay description: Agonist activity at human GABAAalpha2beta2gamma2S receptor expressed in tsA-201cells by FLIPR membrane potential blue assay
In DepthDetails ArticlePubMed
TargetGamma-aminobutyric acid receptor subunit alpha-2/beta-2/gamma-2(Homo sapiens (Human))
University Of Copenhagen
Curated by ChEMBL
LigandPNGBDBM50052801(CHEMBL3322886)
Affinity DataEC50:  9.33E+3nM. Assay description: Agonist activity at human GABAAalpha2beta2gamma2S receptor expressed in tsA-201cells by FLIPR membrane potential blue assay
In DepthDetails ArticlePubMed
TargetGamma-aminobutyric acid receptor subunit alpha-3/beta-2/gamma-2(Homo sapiens (Human))
University Of Copenhagen
Curated by ChEMBL
LigandPNGBDBM50052801(CHEMBL3322886)
Affinity DataEC50:  1.90E+4nM. Assay description: Agonist activity at human GABAAalpha3beta2gamma2S receptor expressed in tsA-201cells by FLIPR membrane potential blue assay
In DepthDetails ArticlePubMed
TargetGamma-aminobutyric acid receptor subunit rho-1(Homo sapiens (Human))
University Of Copenhagen
Curated by ChEMBL
LigandPNGBDBM50052801(CHEMBL3322886)
Affinity DataEC50:  8.10E+3nM. Assay description: Agonist activity at human GABAA rho1 expressed in tsA-201cells by FLIPR membrane potential blue assay
In DepthDetails ArticlePubMed