BDBM50053040 CHEMBL3318760::US9296736, 378::US9593129, Example 378
SMILES CC(C)NS(=O)(=O)C[C@H](C1CC1)N1[C@@H]([C@H](C[C@](C)(CC(O)=O)C1=O)c1cccc(Cl)c1)c1ccc(Cl)cc1
InChI Key InChIKey=OLQSAQIIKIWIRZ-YWCVFVGNSA-N
Data  3 IC50
  Tab Delimited (TSV)   2D SDfile   Computed 3D by Vconf -m prep SDfile
Find this compound or compounds like it in BindingDB:
Activity Spreadsheet -- Enzyme Inhibition Constant Data from BindingDB
Found 3 hits for monomerid = 50053040
LigandPNGBDBM50053040(CHEMBL3318760 | US9296736, 378 | US9593129, Exampl...)
Affinity DataIC50:  0.100nMpH: 7.4 T: 2°C. Assay description: The standard assay conditions for the in vitro HTRF assay consisted of a 50 ul total reaction volume in black 384-well Costar polypropylene plates in...
In DepthDetails US Patent
TargetE3 ubiquitin-protein ligase Mdm2 [1-188](Homo sapiens (Human))
Amgen
US Patent
LigandPNGBDBM50053040(CHEMBL3318760 | US9296736, 378 | US9593129, Exampl...)
Affinity DataIC50:  0.100nM. Assay description: The standard assay conditions for the in vitro HTRF assay consisted of a 50 ul total reaction volume in black 384-well Costar polypropylene plates in...
In DepthDetails US Patent
TargetE3 ubiquitin-protein ligase Mdm2(Homo sapiens (Human))
Amgen
Curated by ChEMBL
LigandPNGBDBM50053040(CHEMBL3318760 | US9296736, 378 | US9593129, Exampl...)
Affinity DataIC50:  0.0980nM. Assay description: Binding affinity to human GST-thrombin-tagged MDM2 assessed as inhibition of interaction with human p53 after 1 hr by HTRF assay in presence of 15% h...
In DepthDetails ArticlePubMed