BDBM50053418 CHEMBL3318852
SMILES OC1(CCN(CC1)C(=O)CCC(=O)c1ccc(F)cc1)c1ccc(Cl)cc1
InChI Key InChIKey=CPIWUAZRERXKBW-UHFFFAOYSA-N
Data  5 KI
  Tab Delimited (TSV)   2D SDfile   Computed 3D by Vconf -m prep SDfile
Find this compound or compounds like it in BindingDB:
Activity Spreadsheet -- Enzyme Inhibition Constant Data from BindingDB
Found 5 hits for monomerid = 50053418
TargetD(2) dopamine receptor(Homo sapiens (Human))
Friedrich-Alexander University
Curated by ChEMBL
LigandPNGBDBM50053418(CHEMBL3318852)
Affinity DataKi:  470nM. Assay description: Displacement of [3H]spiperone from human D2short receptor stably expressed in CHO cell membranes by competitive binding assay
In DepthDetails ArticlePubMed
TargetD(2) dopamine receptor(Homo sapiens (Human))
Friedrich-Alexander University
Curated by ChEMBL
LigandPNGBDBM50053418(CHEMBL3318852)
Affinity DataKi:  860nM. Assay description: Displacement of [3H]spiperone from human D2long receptor stably expressed in CHO cell membranes by competitive binding assay
In DepthDetails ArticlePubMed
TargetD(3) dopamine receptor(Homo sapiens (Human))
Friedrich-Alexander University
Curated by ChEMBL
LigandPNGBDBM50053418(CHEMBL3318852)
Affinity DataKi:  1.70E+3nM. Assay description: Displacement of [3H]spiperone from human D3 receptor stably expressed in CHO cell membranes by competitive binding assay
In DepthDetails ArticlePubMed
TargetD(4) dopamine receptor(Homo sapiens (Human))
Friedrich-Alexander University
Curated by ChEMBL
LigandPNGBDBM50053418(CHEMBL3318852)
Affinity DataKi:  1.80E+4nM. Assay description: Displacement of [3H]spiperone from human D4.4 receptor stably expressed in CHO cell membranes by competitive binding assay
In DepthDetails ArticlePubMed
TargetD(1A) dopamine receptor(Sus scrofa)
Friedrich-Alexander University
Curated by ChEMBL
LigandPNGBDBM50053418(CHEMBL3318852)
Affinity DataKi:  1.90E+4nM. Assay description: Displacement of [3H]SCH23390 from porcine striatal membranes D1 receptor by competitive binding assay
In DepthDetails ArticlePubMed