BDBM50053419 CHEMBL3323046
SMILES O=c1n2CCCc3ccccc3-c2nc2ccc(OCCCN3CCCCC3)cc12
InChI Key InChIKey=PFYRGBJRPBPVMS-UHFFFAOYSA-N
Data  6 IC50
  Tab Delimited (TSV)   2D SDfile   Computed 3D by Vconf -m prep SDfile
Find this compound or compounds like it in BindingDB:
Activity Spreadsheet -- Enzyme Inhibition Constant Data from BindingDB
Found 6 hits for monomerid = 50053419
TargetAcetylcholinesterase(Electrophorus electricus (Electric eel))
Universit£T Regensburg
Curated by ChEMBL
LigandPNGBDBM50053419(CHEMBL3323046)
Affinity DataIC50:  57nM. Assay description: Inhibition of electric eel AChE
In DepthDetails ArticlePubMed
TargetAcetylcholinesterase(Homo sapiens (Human))
Universit£T Regensburg
Curated by ChEMBL
LigandPNGBDBM50053419(CHEMBL3323046)
Affinity DataIC50:  535nM. Assay description: Inhibition of human AChE
In DepthDetails ArticlePubMed
TargetCholinesterase(Equus caballus (Horse))
Universit£T Regensburg
Curated by ChEMBL
LigandPNGBDBM50053419(CHEMBL3323046)
Affinity DataIC50:  2.67E+3nM. Assay description: Inhibition of equine serum BChE
In DepthDetails ArticlePubMed
TargetAcetylcholinesterase(Electrophorus electricus (Electric eel))
Universit£T Regensburg
Curated by ChEMBL
LigandPNGBDBM50053419(CHEMBL3323046)
Affinity DataIC50:  57nM. Assay description: Inhibition of electric eel AChE
In DepthDetails ArticlePubMed
TargetCholinesterase(Equus caballus (Horse))
Universit£T Regensburg
Curated by ChEMBL
LigandPNGBDBM50053419(CHEMBL3323046)
Affinity DataIC50:  2.67E+3nM. Assay description: Inhibition of equine serum BChE
In DepthDetails ArticlePubMed
TargetAcetylcholinesterase(Homo sapiens (Human))
Universit£T Regensburg
Curated by ChEMBL
LigandPNGBDBM50053419(CHEMBL3323046)
Affinity DataIC50:  535nM. Assay description: Inhibition of human AChE
In DepthDetails ArticlePubMed