BDBM50053437 CHEMBL3323065
SMILES O=c1n2CCCCCc2nc2ccc(OCCCN3CCCCC3)cc12
InChI Key InChIKey=DYDMQTJZQBAGEY-UHFFFAOYSA-N
Data  6 IC50
  Tab Delimited (TSV)   2D SDfile   Computed 3D by Vconf -m prep SDfile
Find this compound or compounds like it in BindingDB:
Activity Spreadsheet -- Enzyme Inhibition Constant Data from BindingDB
Found 6 hits for monomerid = 50053437
TargetAcetylcholinesterase(Homo sapiens (Human))
Universit£T Regensburg
Curated by ChEMBL
LigandPNGBDBM50053437(CHEMBL3323065)
Affinity DataIC50:  820nM. Assay description: Inhibition of human AChE
In DepthDetails ArticlePubMed
TargetAcetylcholinesterase(Homo sapiens (Human))
Universit£T Regensburg
Curated by ChEMBL
LigandPNGBDBM50053437(CHEMBL3323065)
Affinity DataIC50:  820nM. Assay description: Inhibition of human AChE
In DepthDetails ArticlePubMed
TargetCholinesterase(Equus caballus (Horse))
Universit£T Regensburg
Curated by ChEMBL
LigandPNGBDBM50053437(CHEMBL3323065)
Affinity DataIC50:  1.27E+4nM. Assay description: Inhibition of equine serum BChE
In DepthDetails ArticlePubMed
TargetCholinesterase(Equus caballus (Horse))
Universit£T Regensburg
Curated by ChEMBL
LigandPNGBDBM50053437(CHEMBL3323065)
Affinity DataIC50:  1.27E+4nM. Assay description: Inhibition of equine serum BChE
In DepthDetails ArticlePubMed
TargetAcetylcholinesterase(Electrophorus electricus (Electric eel))
Universit£T Regensburg
Curated by ChEMBL
LigandPNGBDBM50053437(CHEMBL3323065)
Affinity DataIC50:  43nM. Assay description: Inhibition of electric eel AChE
In DepthDetails ArticlePubMed
TargetAcetylcholinesterase(Electrophorus electricus (Electric eel))
Universit£T Regensburg
Curated by ChEMBL
LigandPNGBDBM50053437(CHEMBL3323065)
Affinity DataIC50:  43nM. Assay description: Inhibition of electric eel AChE
In DepthDetails ArticlePubMed