BDBM50053939 2-(4-Mercapto-1-phenyl-1H-pyrazolo[3,4-d]pyrimidin-6-ylsulfanyl)-hexanoic acid amide::CHEMBL130299
SMILES CCCCC(Sc1nc2n(ncc2c(=S)[nH]1)-c1ccccc1)C(N)=O
InChI Key InChIKey=DSCXDSWHYDECST-UHFFFAOYSA-N
Data  1 KI
  Tab Delimited (TSV)   2D SDfile   Computed 3D by Vconf -m prep SDfile
Find this compound or compounds like it in BindingDB:
Activity Spreadsheet -- Enzyme Inhibition Constant Data from BindingDB
Found 1 hit for monomerid = 50053939
TargetAdenosine receptor A1(Rattus norvegicus (rat))
Griffith University
Curated by ChEMBL
LigandPNGBDBM50053939(2-(4-Mercapto-1-phenyl-1H-pyrazolo[3,4-d]pyrimidin...)
Affinity DataKi:  37.2nM. Assay description: Displacement of [3H]-N6-PIA from Adenosine A1 receptor from rat whole brain
In DepthDetails ArticlePubMed