BDBM50054251 CHEMBL138687::N*2*-Cyclopropylmethyl-6-methyl-N*2*-propyl-N*4*-(2,4,6-trichloro-phenyl)-pyrimidine-2,4-diamine
SMILES CCCN(CC1CC1)c1nc(C)cc(Nc2c(Cl)cc(Cl)cc2Cl)n1
InChI Key InChIKey=UMVDADBXDQGMEG-UHFFFAOYSA-N
Data  1 KI
  Tab Delimited (TSV)   2D SDfile   Computed 3D by Vconf -m prep SDfile
Find this compound or compounds like it in BindingDB:
Activity Spreadsheet -- Enzyme Inhibition Constant Data from BindingDB
Found 1 hit for monomerid = 50054251
TargetCorticotropin-releasing factor receptor 1(Homo sapiens (Human))
Neurocrine Biosciences
Curated by ChEMBL
LigandPNGBDBM50054251(CHEMBL138687 | N*2*-Cyclopropylmethyl-6-methyl-N*2...)
Affinity DataKi: >1.00E+4nM. Assay description: Inhibition of [125I]-CRF binding to human Corticotropin releasing factor receptor 1 tested at 6-12 doses
In DepthDetails ArticlePubMed