BDBM50054637 CHEMBL3318938
SMILES COCCCn1cc(CN(C2CC2)C(=O)[C@H]2CNC[C@H](C2)C(=O)Nc2c(C)cccc2OC)c2ccccc12
InChI Key InChIKey=NBJBSJRWWBHWEO-XZOQPEGZSA-N
Data  2 IC50
  Tab Delimited (TSV)   2D SDfile   Computed 3D by Vconf -m prep SDfile
Find this compound or compounds like it in BindingDB:
Activity Spreadsheet -- Enzyme Inhibition Constant Data from BindingDB
Found 2 hits for monomerid = 50054637
TargetRenin(Homo sapiens (Human))
Novartis Institutes For Biomedical Research
Curated by ChEMBL
LigandPNGBDBM50054637(CHEMBL3318938)
Affinity DataIC50:  2nM. Assay description: Inhibition of human recombinant renin in presence of human plasma using Ac- IHPFHL-VIHNK-(DY-505-X5)-COOH substrate by fluorimetric assay
In DepthDetails ArticlePubMed
TargetRenin(Homo sapiens (Human))
Novartis Institutes For Biomedical Research
Curated by ChEMBL
LigandPNGBDBM50054637(CHEMBL3318938)
Affinity DataIC50:  0.400nM. Assay description: Inhibition of human recombinant renin using fluorescence-quenched RE(EDANS)IHPFHLVIHTK(Dabcyl)R substrate by fluorimetric assay
In DepthDetails ArticlePubMed