BDBM50055346 CHEMBL148500::Sodium; (1-benzyl-3-carbamoylmethyl-2-methyl-1H-indol-4-yloxy)-acetate
SMILES Cc1c(CC(N)=O)c2c(OCC([O-])=O)cccc2n1Cc1ccccc1
InChI Key InChIKey=WMFPGJIEXUIPGN-UHFFFAOYSA-M
Data  1 IC50
  Tab Delimited (TSV)   2D SDfile   Computed 3D by Vconf -m prep SDfile
Find this compound or compounds like it in BindingDB:
Activity Spreadsheet -- Enzyme Inhibition Constant Data from BindingDB
Found 1 hit for monomerid = 50055346
TargetPhospholipase A2, membrane associated(Homo sapiens (Human))
Eli Lilly
Curated by ChEMBL
LigandPNGBDBM50055346(CHEMBL148500 | Sodium; (1-benzyl-3-carbamoylmethyl...)
Affinity DataIC50:  44nM. Assay description: Inhibition of human non-pancreatic secretory phospholipase A2 (PLA2) in a chromogenic assay
In DepthDetails ArticlePubMed