BDBM50055783 2-[5-Methoxy-2-methyl-1-(3-phenyl-propyl)-1H-indol-3-yl]-acetamide::CHEMBL148614
SMILES COc1ccc2n(CCCc3ccccc3)c(C)c(CC(N)=O)c2c1
InChI Key InChIKey=JWUAUTYDZIAVNP-UHFFFAOYSA-N
Data  1 IC50
  Tab Delimited (TSV)   2D SDfile   Computed 3D by Vconf -m prep SDfile
Find this compound or compounds like it in BindingDB:
Activity Spreadsheet -- Enzyme Inhibition Constant Data from BindingDB
Found 1 hit for monomerid = 50055783
TargetPhospholipase A2, membrane associated(Homo sapiens (Human))
Eli Lilly
Curated by ChEMBL
LigandPNGBDBM50055783(2-[5-Methoxy-2-methyl-1-(3-phenyl-propyl)-1H-indol...)
Affinity DataIC50:  1.11E+4nM. Assay description: Inhibition of Human Nonpancreatic Secretory Phospholipase A2 through Chromogenic assay
In DepthDetails ArticlePubMed