BDBM50055928 CHEMBL3321936
SMILES COc1ccc(CC(=O)NC(=N)N[C@H](CC(C)C)C(=O)NCc2cccc(-c3nnn[nH]3)c2F)cc1OC
InChI Key InChIKey=CVPVXVCBSKJOPK-GOSISDBHSA-N
Data  1 IC50
  Tab Delimited (TSV)   2D SDfile   Computed 3D by Vconf -m prep SDfile
Find this compound or compounds like it in BindingDB:
Activity Spreadsheet -- Enzyme Inhibition Constant Data from BindingDB
Found 1 hit for monomerid = 50055928
TargetCathepsin D(Homo sapiens (Human))
Merck
Curated by ChEMBL
LigandPNGBDBM50055928(CHEMBL3321936)
Affinity DataIC50:  280nM. Assay description: Inhibition of human liver cathepsin D using MCA-labeled GKPILFFRLK(Dnp)-D-R-NH2 peptide by fluorescence-based assay
In DepthDetails ArticlePubMed