BDBM50056024 CHEMBL106854::N-{2-[4-(2-Methoxy-phenyl)-piperazin-1-yl]-ethyl}-benzamide
SMILES COc1ccccc1N1CCN(CCNC(=O)c2ccccc2)CC1
InChI Key InChIKey=VINJWMQYVRCWQC-UHFFFAOYSA-N
Data  2 KI
  Tab Delimited (TSV)   2D SDfile   Computed 3D by Vconf -m prep SDfile
Find this compound or compounds like it in BindingDB:
Activity Spreadsheet -- Enzyme Inhibition Constant Data from BindingDB
Found 2 hits for monomerid = 50056024
Target5-hydroxytryptamine receptor 1A(Rattus norvegicus (rat))
Solvay Pharma
Curated by ChEMBL
LigandPNGBDBM50056024(CHEMBL106854 | N-{2-[4-(2-Methoxy-phenyl)-piperazi...)
Affinity DataKi:  1.30nM. Assay description: Binding affinity was evaluated by determining in vitro displacement of [3H]-8-OH-DPAT from the central 5-hydroxytryptamine 1A receptor recognition si...
In DepthDetails ArticlePubMed
TargetD(2) dopamine receptor(Rattus norvegicus (rat))
Solvay Pharma
Curated by ChEMBL
LigandPNGBDBM50056024(CHEMBL106854 | N-{2-[4-(2-Methoxy-phenyl)-piperazi...)
Affinity DataKi:  13nM. Assay description: In vitro displacement of [3H]-spiperone from Dopamine receptor D2 binding site in rat striatum.
In DepthDetails ArticlePubMed