BDBM50059014 3-(3,4-Dimethoxy-benzenesulfonyl)-1-phenyl-imidazolidine-2,4-dione::CHEMBL303431
SMILES COc1ccc(cc1OC)S(=O)(=O)N1C(=O)CN(C1=O)c1ccccc1
InChI Key InChIKey=FHINKGTXICEXAI-UHFFFAOYSA-N
Data  3 IC50
  Tab Delimited (TSV)   2D SDfile   Computed 3D by Vconf -m prep SDfile
Find this compound or compounds like it in BindingDB:
Activity Spreadsheet -- Enzyme Inhibition Constant Data from BindingDB
Found 3 hits for monomerid = 50059014
TargetChymotrypsinogen A(Bos taurus (bovine))
Suntory
Curated by ChEMBL
LigandPNGBDBM50059014(3-(3,4-Dimethoxy-benzenesulfonyl)-1-phenyl-imidazo...)
Affinity DataIC50: >1.00E+5nM. Assay description: Inhibitory activity against bovine pancreas alpha-chymotrypsin in vitro
In DepthDetails ArticlePubMed
TargetChymase(Homo sapiens (Human))
Suntory
Curated by ChEMBL
LigandPNGBDBM50059014(3-(3,4-Dimethoxy-benzenesulfonyl)-1-phenyl-imidazo...)
Affinity DataIC50:  110nM. Assay description: Inhibitory activity against human heart chymase in vitro.
In DepthDetails ArticlePubMed
TargetCathepsin G(Homo sapiens (Human))
Suntory
Curated by ChEMBL
LigandPNGBDBM50059014(3-(3,4-Dimethoxy-benzenesulfonyl)-1-phenyl-imidazo...)
Affinity DataIC50:  4.10E+3nM. Assay description: Inhibitory activity against human neutrophil cathepsin G.
In DepthDetails ArticlePubMed