BDBM50060135 4-Amino-cyclopentane-1,2,4-tricarboxylic acid::CHEMBL104116
SMILES NC1(CC(C(C1)C(O)=O)C(O)=O)C(O)=O
InChI Key InChIKey=FERIKTBTNCSGJS-UHFFFAOYSA-N
Data  1 EC50
  Tab Delimited (TSV)   2D SDfile   Computed 3D by Vconf -m prep SDfile
Find this compound or compounds like it in BindingDB:
Activity Spreadsheet -- Enzyme Inhibition Constant Data from BindingDB
Found 1 hit for monomerid = 50060135
TargetMetabotropic glutamate receptor 4(Homo sapiens (Human))
Université
Curated by ChEMBL
LigandPNGBDBM50060135(4-Amino-cyclopentane-1,2,4-tricarboxylic acid | CH...)
Affinity DataEC50:  4.00E+4nM. Assay description: Agonist activity against Metabotropic glutamate receptor 4 expressed in HEK 293 cells was evaluated by measuring total inositol phosphate accumulatio...
In DepthDetails ArticlePubMed