BDBM50060676 CHEMBL3394704
SMILES COc1ccc(OC)c2c1CCN1C(=O)c3ccccc3C21O
InChI Key InChIKey=MTFONUQQGGUXIO-UHFFFAOYSA-N
Data  1 IC50
  Tab Delimited (TSV)   2D SDfile   Computed 3D by Vconf -m prep SDfile
Find this compound or compounds like it in BindingDB:
Activity Spreadsheet -- Enzyme Inhibition Constant Data from BindingDB
Found 1 hit for monomerid = 50060676
TargetPoly [ADP-ribose] polymerase 1(Homo sapiens (Human))
Pondicherry University
Curated by ChEMBL
LigandPNGBDBM50060676(CHEMBL3394704)
Affinity DataIC50:  1.28E+3nM. Assay description: Inhibition of PARP1 (unknown origin) in presence of NAD+ by homogenous fluorescence plate assay
In DepthDetails ArticlePubMed