BDBM50061951 (3-Benzyl-8-methyl-6-propyl-8-aza-bicyclo[3.2.1]oct-2-yl)-acetic acid methyl ester::CHEMBL3085523
SMILES COC(=O)C[C@@H]1C2C[C@@H](Cc3ccccc3)C(C[C@@H]1Cc1ccccc1)N2C
InChI Key InChIKey=XXQUTIIQIQULCG-VOZKMPIISA-N
Data  1 KI
  Tab Delimited (TSV)   2D SDfile   Computed 3D by Vconf -m prep SDfile
Find this compound or compounds like it in BindingDB:
Activity Spreadsheet -- Enzyme Inhibition Constant Data from BindingDB
Found 1 hit for monomerid = 50061951
TargetSodium-dependent dopamine transporter(Rattus norvegicus (rat))
University Of New Orleans
Curated by ChEMBL
LigandPNGBDBM50061951((3-Benzyl-8-methyl-6-propyl-8-aza-bicyclo[3.2.1]oc...)
Affinity DataKi:  3.08E+3nM. Assay description: Displacement of [3H]WIN-35428 from dopamine transporter in rat caudate putamen tissue
In DepthDetails ArticlePubMed