BDBM50061959 (3,6-Dibenzyl-8-methyl-8-aza-bicyclo[3.2.1]oct-2-yl)-acetic acid methyl ester::CHEMBL3084338
SMILES COC(=O)C[C@H]1C2C[C@@H](Cc3ccccc3)C(C[C@@H]1Cc1ccccc1)N2C
InChI Key InChIKey=XXQUTIIQIQULCG-NAZAXOCESA-N
Data  1 KI
  Tab Delimited (TSV)   2D SDfile   Computed 3D by Vconf -m prep SDfile
Find this compound or compounds like it in BindingDB:
Activity Spreadsheet -- Enzyme Inhibition Constant Data from BindingDB
Found 1 hit for monomerid = 50061959
TargetSodium-dependent dopamine transporter(Rattus norvegicus (rat))
University Of New Orleans
Curated by ChEMBL
LigandPNGBDBM50061959((3,6-Dibenzyl-8-methyl-8-aza-bicyclo[3.2.1]oct-2-y...)
Affinity DataKi:  7.59E+3nM. Assay description: Displacement of [3H]WIN-35428 from dopamine transporter in rat caudate putamen tissue
In DepthDetails ArticlePubMed