BDBM50061961 (3,6-Dibenzyl-8-methyl-8-aza-bicyclo[3.2.1]oct-2-yl)-acetic acid methyl ester; hydrochloride::CHEMBL545778
SMILES COC(=O)CC1C2CC(Cc3ccccc3)C(CC1Cc1ccccc1)N2C
InChI Key InChIKey=XXQUTIIQIQULCG-UHFFFAOYSA-N
Data  1 KI
  Tab Delimited (TSV)   2D SDfile   Computed 3D by Vconf -m prep SDfile
Find this compound or compounds like it in BindingDB:
Activity Spreadsheet -- Enzyme Inhibition Constant Data from BindingDB
Found 1 hit for monomerid = 50061961
TargetSodium-dependent dopamine transporter(Rattus norvegicus (rat))
University Of New Orleans
Curated by ChEMBL
LigandPNGBDBM50061961((3,6-Dibenzyl-8-methyl-8-aza-bicyclo[3.2.1]oct-2-y...)
Affinity DataKi:  3.08E+3nM. Assay description: Displacement of [3H]WIN-35428 from dopamine transporter in rat caudate putamen tissue
In DepthDetails ArticlePubMed