BDBM50062859 8-Cyclopentyl-1-ethoxymethyl-3-propyl-3,7-dihydro-purine-2,6-dione::CHEMBL152294
SMILES CCCn1c2nc([nH]c2c(=O)n(COCC)c1=O)C1CCCC1
InChI Key InChIKey=VQCZRQPXJUZMNM-UHFFFAOYSA-N
Data  1 KI
  Tab Delimited (TSV)   2D SDfile   Computed 3D by Vconf -m prep SDfile
Find this compound or compounds like it in BindingDB:
Activity Spreadsheet -- Enzyme Inhibition Constant Data from BindingDB
Found 1 hit for monomerid = 50062859
TargetAdenosine receptor A1(BOVINE)
Forschungszentrum JüLich
Curated by ChEMBL
LigandPNGBDBM50062859(8-Cyclopentyl-1-ethoxymethyl-3-propyl-3,7-dihydro-...)
Affinity DataKi:  0.286nM. Assay description: Displacement of [3H]-CPX from Adenosine A1 receptor of bovine brain cerebral cortex membranes
In DepthDetails ArticlePubMed