BDBM50063108 6,8,8-Trimethyl-4-trifluoromethyl-6,7,8,9-tetrahydro-1H-pyrido[3,2-g]quinolin-2-one::CHEMBL156142
SMILES CC1CC(C)(C)Nc2cc3[nH]c(=O)cc(c3cc12)C(F)(F)F
InChI Key InChIKey=SWMIPBWORQVDRL-UHFFFAOYSA-N
Data  1 KI  2 IC50
  Tab Delimited (TSV)   2D SDfile   Computed 3D by Vconf -m prep SDfile
Find this compound or compounds like it in BindingDB:
Activity Spreadsheet -- Enzyme Inhibition Constant Data from BindingDB
Found 2 hits for monomerid = 50063108
TargetAndrogen receptor(Homo sapiens (Human))
Ligand Pharmaceuticals
Curated by ChEMBL
LigandPNGBDBM50063108(6,8,8-Trimethyl-4-trifluoromethyl-6,7,8,9-tetrahyd...)
Affinity DataIC50:  26nM. Assay description: Antagonistic activity against human androgen receptor (hAR) in co-transfected CV-1 cells.
In DepthDetails ArticlePubMed
TargetProgesterone receptor(Homo sapiens (Human))
Ligand Pharmaceuticals
Curated by ChEMBL
LigandPNGBDBM50063108(6,8,8-Trimethyl-4-trifluoromethyl-6,7,8,9-tetrahyd...)
Affinity DataIC50:  231nM. Assay description: Antagonistic activity against human progesterone receptor B (hPR-B) in co-transfected CV-1 cells.
In DepthDetails ArticlePubMed