BDBM50063793 1-(8-tert-Butyl-4,4-dimethyl-thiochroman-6-yl)-pentan-1-one::CHEMBL276800
SMILES CCCCC(=O)c1cc(c2SCCC(C)(C)c2c1)C(C)(C)C
InChI Key InChIKey=UUUXOINBGSTWMN-UHFFFAOYSA-N
Data  2 IC50
  Tab Delimited (TSV)   2D SDfile   Computed 3D by Vconf -m prep SDfile
Find this compound or compounds like it in BindingDB:
Activity Spreadsheet -- Enzyme Inhibition Constant Data from BindingDB
Found 2 hits for monomerid = 50063793
TargetProstaglandin G/H synthase 2(Homo sapiens (Human))
Procter & Gamble Pharmaceuticals
Curated by ChEMBL
LigandPNGBDBM50063793(1-(8-tert-Butyl-4,4-dimethyl-thiochroman-6-yl)-pen...)
Affinity DataIC50:  400nM. Assay description: Inhibition of Prostaglandin G/H synthase 2 (COX-2).
In DepthDetails ArticlePubMed
TargetProstaglandin G/H synthase 1(Homo sapiens (Human))
Procter & Gamble Pharmaceuticals
Curated by ChEMBL
LigandPNGBDBM50063793(1-(8-tert-Butyl-4,4-dimethyl-thiochroman-6-yl)-pen...)
Affinity DataIC50:  400nM. Assay description: Inhibition of Prostaglandin G/H synthase 1 (COX-1).
In DepthDetails ArticlePubMed