BDBM50064018 7-Allyl-azepan-(2Z)-ylideneamine; hydrochloride::CHEMBL544693
SMILES NC1=NC(CC=C)CCCC1
InChI Key InChIKey=WWIMYYAFPJINKP-UHFFFAOYSA-N
Data  4 IC50
  Tab Delimited (TSV)   2D SDfile   Computed 3D by Vconf -m prep SDfile
Find this compound or compounds like it in BindingDB:
Activity Spreadsheet -- Enzyme Inhibition Constant Data from BindingDB
Found 4 hits for monomerid = 50064018
TargetNitric oxide synthase, endothelial(Homo sapiens (Human))
Pfizer
Curated by ChEMBL
LigandPNGBDBM50064018(7-Allyl-azepan-(2Z)-ylideneamine; hydrochloride | ...)
Affinity DataIC50:  2.10E+4nM. Assay description: Inhibitory activity evaluated from soluble cell extract of human endothelia constitutive enzyme (Endothelial nitric oxide synthase) and partially pur...
In DepthDetails ArticlePubMed
TargetNitric oxide synthase, brain(Homo sapiens (Human))
Pfizer
Curated by ChEMBL
LigandPNGBDBM50064018(7-Allyl-azepan-(2Z)-ylideneamine; hydrochloride | ...)
Affinity DataIC50:  870nM. Assay description: Inhibitory activity evaluated from soluble cell extract of human Neuronal nitric oxide synthase and partially purified by DEAE-sepharose chromatograp...
In DepthDetails ArticlePubMed
TargetNitric oxide synthase, inducible(Mus musculus (mouse))
Pfizer
Curated by ChEMBL
LigandPNGBDBM50064018(7-Allyl-azepan-(2Z)-ylideneamine; hydrochloride | ...)
Affinity DataIC50:  600nM. Assay description: The ability of compound to inhibit mouse Inducible nitric oxide synthase in LPS stimulated mouse RAW cells was determined
In DepthDetails ArticlePubMed
TargetNitric oxide synthase, inducible(Homo sapiens (Human))
Pfizer
Curated by ChEMBL
LigandPNGBDBM50064018(7-Allyl-azepan-(2Z)-ylideneamine; hydrochloride | ...)
Affinity DataIC50:  190nM. Assay description: Inhibitory activity evaluated for soluble cell extract of human Inducible nitric oxide synthase and partially purified by DEAE-sepharose chromatograp...
In DepthDetails ArticlePubMed